Beiträge von Malo_60

    Hallo liebe Mitglieder,


    ich habe mir im Internet eine Xiaomi Aussenkamera gekauft, bekomme diese aber leider nicht in der my home App verbunden. Wichtig, es handelt sich um die Aussenkamera! Ich hab die 360' kameras von Xiaomi und die laufen ohne Probleme in der App. Server ist ganz normal auf Deutschland gestellt! Kann es sein, dass es an dem Land liegt vom Server? Hatte jemand mal dieses Thema?


    Liebe Grüße

    2. Teil


    compilation terminated.

    make: *** [Release/obj.target/authenticate_pam/authenticate_pam.o] Fehler 1

    gyp


    ERR!

    build error

    gyp

    ERR! stack Error: `make` failed with exit code: 2gyp ERR! stack at ChildProcess.onExit (/usr/local/lib/node_modules/npm/node_modules/node-gyp/lib/build.js:262:23)

    gyp ERR! stack at ChildProcess.emit (events.js:197:13)

    gyp ERR! stack at Process.ChildProcess._handle.onexit (internal/child_process.js:254:12)

    gyp ERR! System Linux 4.14.62-v7+gyp ERR! command "/usr/local/bin/node" "/usr/local/lib/node_modules/npm/node_modules/node-gyp/bin/node-gyp.js" "rebuild"

    gyp ERR! cwd /opt/iobroker/node_modules/authenticate-pam

    gyp ERR! node -v v11.10.1

    gyp ERR! node-gyp -v v3.8.0

    gyp ERR! not ok

    prebuild-install WARN install No prebuilt binaries found (target=11.10.1 runtime=node arch=arm libc= platform=linux)

    In file included from /usr/include/linux/errno.h:1:0, from /usr/include/arm-linux-gnueabihf/bits/errno.h:24,

    from /usr/include/errno.h:35,

    from /home/pi/.node-gyp/11.10.1/include/node/uv/errno.h:25,

    from /home/pi/.node-gyp/11.10.1/include/node/uv.h:48,

    from ../node_modules/nan/nan.h:52,

    from ../src/./serialport.h:6,

    from ../src/serialport.cpp:1:

    /usr/include/arm-linux-gnueabihf/asm/errno.h:1:31: fatal error: /usr/include/asm-generic/errno.h: Die Struktur muss bereinigt werden

    #include <asm-generic/errno.h>

    ^

    compilation terminated.

    make: *** [Release/obj.target/bindings/src/serialport.o] Fehler 1

    gyp

    ERR! build error

    gyp ERR! stack Error: `make` failed with exit code: 2gyp ERR! stack at ChildProcess.onExit (/usr/local/lib/node_modules/npm/node_modules/node-gyp/lib/build.js:262:23)

    gyp ERR! stack at ChildProcess.emit (events.js:197:13)

    gyp

    ERR! stack at Process.ChildProcess._handle.onexit (internal/child_process.js:254:12)gyp ERR! System Linux 4.14.62-v7+

    gyp ERR! command "/usr/local/bin/node" "/usr/local/lib/node_modules/npm/node_modules/node-gyp/bin/node-gyp.js" "rebuild"

    gyp ERR! cwd /opt/iobroker/node_modules/@serialport/bindingsgyp ERR! node -v v11.10.1

    gyp ERR! node-gyp -v v3.8.0

    gyp ERR! not ok

    npm

    WARN optional

    SKIPPING OPTIONAL DEPENDENCY: authenticate-pam@1.0.2 (node_modules/authenticate-pam):

    npm


    WARN

    optional

    SKIPPING OPTIONAL DEPENDENCY: authenticate-pam@1.0.2 install: `node-gyp rebuild`npm


    WARN

    optional SKIPPING OPTIONAL DEPENDENCY: Exit status 1


    npm

    ERR!

    code

    ELIFECYCLE

    npm

    ERR!

    errno

    1

    npm


    ERR! @serialport/bindings@2.0.7 install: `prebuild-install --tag-prefix @serialport/bindings@ || node-gyp rebuild`

    npm ERR! Exit status 1npm ERR!

    npm ERR! Failed at the @serialport/bindings@2.0.7 install script.

    npm ERR! This is probably not a problem with npm. There is likely additional logging output above.

    npm ERR! A complete log of this run can be found in:npm ERR! /home/pi/.npm/_logs/2019-03-05T09_21_12_665Z-debug.log


    host.ioBroker-RasPi install adapter zigbee

    NPM version: 6.7.0

    npm install iobroker.zigbee --production --save --prefix "/opt/iobroker" (System call)

    In file included from /usr/include/linux/errno.h:1:0, from /usr/include/arm-linux-gnueabihf/bits/errno.h:24,

    from /usr/include/errno.h:35,

    from /home/pi/.node-gyp/11.10.1/include/node/uv/errno.h:25,

    from /home/pi/.node-gyp/11.10.1/include/node/uv.h:48,

    from ../../nan/nan.h:50,

    from ../authenticate_pam.cc:23:

    /usr/include/arm-linux-gnueabihf/asm/errno.h:1:31: fatal error: /usr/include/asm-generic/errno.h: Die Struktur muss bereinigt werden

    #include <asm-generic/errno.h>

    ^

    compilation terminated.


    make: *** [Release/obj.target/authenticate_pam/authenticate_pam.o] Fehler 1

    gyp

    ERR! build error

    gyp ERR! stack Error: `make` failed with exit code: 2gyp ERR! stack at ChildProcess.onExit (/usr/local/lib/node_modules/npm/node_modules/node-gyp/lib/build.js:262:23)

    gyp ERR! stack

    at ChildProcess.emit (events.js:197:13)gyp ERR! stack at Process.ChildProcess._handle.onexit (internal/child_process.js:254:12)

    gyp

    ERR! System Linux 4.14.62-v7+gyp ERR! command "/usr/local/bin/node" "/usr/local/lib/node_modules/npm/node_modules/node-gyp/bin/node-gyp.js" "rebuild"

    gyp ERR! cwd

    /opt/iobroker/node_modules/authenticate-pamgyp ERR! node -v v11.10.1

    gyp ERR! node-gyp -v v3.8.0

    gyp ERR! not ok


    prebuild-install

    WARN install No prebuilt binaries found (target=11.10.1 runtime=node arch=arm libc= platform=linux)

    In file included from /usr/include/linux/errno.h:1:0, from /usr/include/arm-linux-gnueabihf/bits/errno.h:24,

    from /usr/include/errno.h:35,

    from /home/pi/.node-gyp/11.10.1/include/node/uv/errno.h:25,

    from /home/pi/.node-gyp/11.10.1/include/node/uv.h:48,

    from ../node_modules/nan/nan.h:52,

    from ../src/./serialport.h:6,

    from ../src/serialport.cpp:1:

    /usr/include/arm-linux-gnueabihf/asm/errno.h:1:31: fatal error: /usr/include/asm-generic/errno.h: Die Struktur muss bereinigt werden

    #include <asm-generic/errno.h>

    ^


    compilation terminated.

    make: *** [Release/obj.target/bindings/src/serialport.o] Fehler 1

    gyp


    ERR! build error

    gyp ERR! stack Error: `make` failed with exit code: 2gyp ERR! stack at ChildProcess.onExit (/usr/local/lib/node_modules/npm/node_modules/node-gyp/lib/build.js:262:23)

    gyp ERR! stack at ChildProcess.emit (events.js:197:13)

    gyp

    ERR! stack at Process.ChildProcess._handle.onexit (internal/child_process.js:254:12)gyp

    ERR! System Linux 4.14.62-v7+gyp ERR! command "/usr/local/bin/node" "/usr/local/lib/node_modules/npm/node_modules/node-gyp/bin/node-gyp.js" "rebuild"


    gyp ERR! cwd /opt/iobroker/node_modules/@serialport/bindingsgyp ERR! node -v v11.10.1

    gyp ERR! node-gyp -v v3.8.0

    gyp ERR! not ok


    npm

    WARN optional SKIPPING OPTIONAL DEPENDENCY: authenticate-pam@1.0.2 (node_modules/authenticate-pam):npm WARN

    optional SKIPPING OPTIONAL DEPENDENCY: authenticate-pam@1.0.2 install: `node-gyp rebuild`npm WARN optional

    SKIPPING OPTIONAL DEPENDENCY: Exit status 1

    npm

    ERR!

    code ELIFECYCLE

    npm ERR! errno 1

    npm ERR! @serialport/bindings@2.0.7 install: `prebuild-install --tag-prefix @serialport/bindings@ || node-gyp rebuild`npm ERR! Exit status 1

    npm ERR!

    npm

    ERR! Failed at the @serialport/bindings@2.0.7 install script.

    npm ERR! This is probably not a problem with npm. There is likely additional logging output above.

    npm

    ERR! A complete log of this run can be found in:npm

    ERR! /home/pi/.npm/_logs/2019-03-05T09_21_53_260Z-debug.log

    host.ioBroker-RasPi install adapter zigbee

    ERROR: host.ioBroker-RasPi Cannot install zigbee

    ERROR: process exited with code 13

    1. Teil


    $ ./iobroker add zigbee --host ioBroker-RasPi

    NPM version: 6.7.0

    npm install iobroker.zigbee --production --save --prefix "/opt/iobroker" (System call)

    In file included from /usr/include/linux/errno.h:1:0, from /usr/include/arm-linux-gnueabihf/bits/errno.h:24,

    from /usr/include/errno.h:35,

    from /home/pi/.node-gyp/11.10.1/include/node/uv/errno.h:25,

    from /home/pi/.node-gyp/11.10.1/include/node/uv.h:48,

    from ../../nan/nan.h:50,

    from ../authenticate_pam.cc:23:

    /usr/include/arm-linux-gnueabihf/asm/errno.h:1:31: fatal error: /usr/include/asm-generic/errno.h: Die Struktur muss bereinigt werden

    #include <asm-generic/errno.h>

    ^

    compilation terminated.


    make: *** [Release/obj.target/authenticate_pam/authenticate_pam.o] Fehler 1

    gyp ERR! build error gyp ERR! stack Error: `make` failed with exit code: 2

    gyp ERR! stack at ChildProcess.onExit (/usr/local/lib/node_modules/npm/node_modules/node-gyp/lib/build.js:262:23)

    gyp ERR! stack at ChildProcess.emit (events.js:197:13)

    gyp ERR! stack at Process.ChildProcess._handle.onexit (internal/child_process.js:254:12)

    gyp ERR! System Linux 4.14.62-v7+

    gyp ERR! command "/usr/local/bin/node" "/usr/local/lib/node_modules/npm/node_modules/node-gyp/bin/node-gyp.js" "rebuild"

    gyp ERR! cwd /opt/iobroker/node_modules/authenticate-pam

    gyp ERR! node -v v11.10.1

    gyp ERR! node-gyp -v v3.8.0

    gyp ERR! not ok


    prebuild-install

    WARN install No prebuilt binaries found (target=11.10.1 runtime=node arch=arm libc= platform=linux)

    In file included from /usr/include/linux/errno.h:1:0, from /usr/include/arm-linux-gnueabihf/bits/errno.h:24,

    from /usr/include/errno.h:35,

    from /home/pi/.node-gyp/11.10.1/include/node/uv/errno.h:25,

    from /home/pi/.node-gyp/11.10.1/include/node/uv.h:48,

    from ../node_modules/nan/nan.h:52,

    from ../src/./serialport.h:6,

    from ../src/serialport.cpp:1:

    /usr/include/arm-linux-gnueabihf/asm/errno.h:1:31: fatal error: /usr/include/asm-generic/errno.h: Die Struktur muss bereinigt werden

    #include <asm-generic/errno.h>

    ^


    compilation terminated.

    make: *** [Release/obj.target/bindings/src/serialport.o] Fehler 1

    gyp


    ERR! build error

    gyp ERR! stack Error: `make` failed with exit code: 2gyp ERR! stack at ChildProcess.onExit (/usr/local/lib/node_modules/npm/node_modules/node-gyp/lib/build.js:262:23)

    gyp ERR! stack at ChildProcess.emit (events.js:197:13)

    gyp ERR! stack

    at Process.ChildProcess._handle.onexit (internal/child_process.js:254:12)gyp ERR! System Linux 4.14.62-v7+

    gyp

    ERR! command "/usr/local/bin/node" "/usr/local/lib/node_modules/npm/node_modules/node-gyp/bin/node-gyp.js" "rebuild"gyp ERR!

    cwd /opt/iobroker/node_modules/@serialport/bindingsgyp ERR! node -v v11.10.1

    gyp ERR! node-gyp -v v3.8.0

    gyp ERR! not ok


    npm

    WARN optional SKIPPING OPTIONAL DEPENDENCY: authenticate-pam@1.0.2 (node_modules/authenticate-pam):npm WARN optional SKIPPING OPTIONAL DEPENDENCY: authenticate-pam@1.0.2 install: `node-gyp rebuild`

    npm WARN optional SKIPPING OPTIONAL DEPENDENCY: Exit status 1



    npm

    ERR! code ELIFECYCLEnpm ERR! errno 1


    npm ERR! @serialport/bindings@2.0.7 install: `prebuild-install --tag-prefix @serialport/bindings@ || node-gyp rebuild`npm ERR! Exit status 1

    npm ERR!

    npm ERR! Failed at the @serialport/bindings@2.0.7 install script.

    npm ERR!

    This is probably not a problem with npm. There is likely additional logging output above.

    npm ERR! A complete log of this run can be found in:

    npm ERR! /home/pi/.npm/_logs/2019-03-05T09_20_32_444Z-debug.log


    host.ioBroker-RasPi install adapter zigbee

    NPM version: 6.7.0

    npm install iobroker.zigbee --production --save --prefix "/opt/iobroker" (System call)

    In file included from /usr/include/linux/errno.h:1:0, from /usr/include/arm-linux-gnueabihf/bits/errno.h:24,

    from /usr/include/errno.h:35,

    from /home/pi/.node-gyp/11.10.1/include/node/uv/errno.h:25,

    from /home/pi/.node-gyp/11.10.1/include/node/uv.h:48,

    from ../../nan/nan.h:50,

    from ../authenticate_pam.cc:23:

    /usr/include/arm-linux-gnueabihf/asm/errno.h:1:31: fatal error: /usr/include/asm-generic/errno.h: Die Struktur muss bereinigt werden

    #include <asm-generic/errno.h>

    ^



    Habe nun auch das Problem dass mein sonoff adapter sich einfach nicht verbindet. Er leuchtet dauerhaft gelb. Habe aber die Einstellungen alle vorgenommen,m lässt sich über touch steuern und im main menü unter toogle auch. nur verbindet er sich anscheinend nicht mit dem Sonoff. Kann jemand helfen?


    Verbunden mit Host......wahr

    Lebenszeichen........wahr

    verbunden mit Sonoff.....falsch

    irgendwie ist der text weg.


    Habe alles versucht mit ATOM neu installieren sowie tasmota neu downloaden. beide ordner in "D".

    kommen die fehler vom kommentar davor..


    muss dazu sagen ich habe nicht mal was geändert und wollte mal schauen ob die runtergeladene Datei gleich schon ein Fehler beim "bauen" anzeigt. Und das ist der Fall.

    Oggy1 ; sorry ?( hier die komplette Fehlermeldung:

    schimmer-media.de/index.php?attachment/4454/


    zu deinen fragen bzw aussagen:


    1. treiber habe ich von windwos runter laden lassen. habe aber zusätzlich einen von ftdichip runter geladen (nur kann ich nicht sagen bzw weiß wo man schaut welcher aktiv ist)


    2. atom habe ich nochmal überprüft, habe die gleiche einstellungen wie master67 auf der von ihm verlinkten seite. So lange ich die Fehlermdlung noch habe, kann ich ja nicht hochladen :D.


    3. hierzu lade ich mal die bilder hoch. bin mir eigentlich sicher dass das passen sollte.

    4. was ist das, wenn ich mal blöd fragen darf :/


    5. er leuchtet nicht, spricht nicht auf berührungen an, deswegen bin ich der überzeugung dass er im flash modus ist. kann mich natürlich auch irren. aber oben in den bildern sieht man wie ich ihn vor dem einstecken zum flashen bringe.



    31igerMove ; die einstellungen habe ich genau wie du. Nur ein paar Ordner mehr. Weil Atom mehrere Bibliotheken nicht gefunden hat. Dann habe ich den Tasmota Ordner in den libraries von arduino komplett rein kopiert.


    schimmer-media.de/index.php?attachment/4455/




    danke euch für eure Hilfe :thumbup:

    also rx und tx habe ich getauscht nachdem ich diesen Fehler gehabt habe, nochmal versucht und wieder den gleichen Fehler. Im flash status bin ich der meinung habe ich ihn. Er ist wie dennis es nennt "tot". Macht keinen mucks wenn ich ihn überbrücke mit gpio00 und ground. Kann es an den einstellungen liegen von "werkzeuge" habe es eigentlich befolgt wie in github bei der Anleitung. Ich möchte den snoff Touch flashen.


    schimmer-media.de/index.php?attachment/4450/